locked
Parameters on Proclarity 6.3 Dashboard RRS feed

  • Question

  • When Creating a New Parameter on DashBoard Studion in Proclarity 6.3 following error is coming, Please help me you have any information.
    Error 6202
    System.Web.Services.Protocols.SoapException: System.Web.Services.Protocols.SoapException: Server was unable to process request.
    ---> System.InvalidOperationException: App_Web_default.aspx.cdcab7d2.dll
       at ProClarity.Dashboard.PluginSupport.PClassFactory.Initialize()
     
     at ProClarity.Dashboard.PluginSupport.PClassFactory..ctor()
       at ProClarity.Dashboard.PluginSupport.PClassFactory.get_Instance()
      
    at ProClarity.Dashboard.BuilderService.GetParameterControls()
       --- End of inner exception stack trace ---
       at System.Web.Services.Protocols.SoapHttpClientProtocol.ReadResponse(SoapClientMessage message, WebResponse response,
     Stream responseStream, Boolean asyncCall)
       at System.Web.Services.Protocols.SoapHttpClientProtocol.Invoke(String methodName, Object[] parameters)
       at ProClarity.Dashboard.Builder.BuilderService.BuilderService.GetParameterControls()
       at ProClarity.Dashboard.Builder.Common.GetParameterControls()

    Monday, September 28, 2009 6:07 PM

Answers

  • Resolved this by running repair installation as few files were missing.
    • Marked as answer by ahkreddy Monday, December 28, 2009 4:24 PM
    Monday, December 28, 2009 4:24 PM