none
about WLK1.5 USB Host Controller Compliance (Automated) fail item problem RRS feed

  • Pytanie

  • I have the  fail for USB test of WLK1.5
    The log file as below
    And I have updated the latest filter, it still fail

     

     

    Start Test 12/24/2009 4:49:15.054 PM <<< FAILED: BUSPORT-0041 - XHCI Spec Version >>>
    Error 12/24/2009 4:49:15.054 PM +VAR+SEV1 2 : <<< FAILED: BUSPORT-0041 - XHCI Spec Version >>>
    File:   d:\5429t\testsrc\driverstest\usb\inteldrop\hw32\usb\pc_2001\usbhcvct\versiontests.c Line: 454
    Error Type:    
    Error Code:   0x0
    Error Text:   Error 0x00000000
    End Test 12/24/2009 4:49:15.054 PM <<< FAILED: BUSPORT-0041 - XHCI Spec Version >>>
    Result:   Fail
    Repro:   C:\WTT\JobsWorkingDir\Tasks\WTTJobRun4E2A3D61-CC77-41BF-8B21-06ED965F7DB8\Usbhcvct.exe -l Usbhcvct.log
    Message 12/24/2009 4:49:15.054 PM +TEST+INFO :
     
    Message 12/24/2009 4:49:15.054 PM +TEST+INFO :
     
    Context _ _
    Context Index:   2969525450
    Current:   <<< FAILED: USB Test Assertion 9.1.B1 >>>
    Parent:   WTTLOG
    Start Test 12/24/2009 4:49:15.054 PM <<< FAILED: USB Test Assertion 9.1.B1 >>>
    Error 12/24/2009 4:49:15.054 PM +VAR+SEV1 3 : <<< FAILED: USB Test Assertion 9.1.B1 >>>
    File:   d:\5429t\testsrc\driverstest\usb\inteldrop\hw32\usb\pc_2001\usbhcvct\usbhcvct.c Line: 455
    Error Type:    
    Error Code:   0x0
    Error Text:   Error 0x00000000
    End Test 12/24/2009 4:49:15.054 PM <<< FAILED: USB Test Assertion 9.1.B1 >>>
    Result:   Fail
    Repro:   C:\WTT\JobsWorkingDir\Tasks\WTTJobRun4E2A3D61-CC77-41BF-8B21-06ED965F7DB8\Usbhcvct.exe -l Usbhcvct.log
    Context _ _
    Context Index:   1432353587
    Current:   <<< USB Host Controller Version Compliance Test : Test Failed >>>
    Parent:   WTTLOG
    Start Test 12/24/2009 4:49:15.054 PM <<< USB Host Controller Version Compliance Test : Test Failed >>>
    Error 12/24/2009 4:49:15.054 PM +TEST+SEV1 : <<< USB Host Controller Version Compliance Test : Test Failed >>>
    File:   d:\5429t\testsrc\driverstest\usb\inteldrop\hw32\usb\pc_2001\usbhcvct\usbhcvct.c Line: 457
    Error Type:    
    Error Code:   0x0
    Error Text:   Error 0x00000000
    End Test 12/24/2009 4:49:15.054 PM <<< USB Host Controller Version Compliance Test : Test Failed >>>
    Result:   Fail
    Repro:   C:\WTT\JobsWorkingDir\Tasks\WTTJobRun4E2A3D61-CC77-41BF-8B21-06ED965F7DB8\Usbhcvct.exe -l Usbhcvct.log

    piątek, 26 listopada 2010 12:43

Odpowiedzi

Wszystkie odpowiedzi